Testsuite: org.openscience.cdk.modulesuites.MsmilesTests
 Tests run: 258, Failures: 5, Errors: 0, Time elapsed: 4.386 sec
 
 ------------- Standard Output ---------------
 smiles.SmilesParser#setPreservingAromaticity(boolean) does not have a test method
 smiles.SmilesParser#isPreservingAromaticity() does not have a test method
 smiles.SmilesGenerator#createSMILES(IReaction) does not have a test method
 smiles.SmilesGenerator#createSMILES(IAtomContainer,boolean,[Z) does not have a test method
 smiles.SmilesGenerator#getRingFinder() does not have a test method
 smiles.SmilesGenerator#setRingFinder(AllRingsFinder) does not have a test method
 smiles.SmilesGenerator#isValidDoubleBondConfiguration(IAtomContainer,IBond) does not have a test method
 smiles.SmilesGenerator#setRings(IRingSet) does not have a test method
 io.SMILESWriter#write(IChemObject) does not have a test method
 io.SMILESWriter#getIOSettings() does not have a test method
 io.SMILESWriter#setWriter(OutputStream) does not have a test method
 io.SMILESWriter#setWriter(Writer) does not have a test method
 io.SMILESWriter#writeMoleculeSet(IMoleculeSet) does not have a test method
 io.SMILESWriter#writeMolecule(IMolecule) does not have a test method
 io.SMILESWriter#customizeJob() does not have a test method
 io.iterator.IteratingSMILESReader#setReader has a test method annotation 'testSetReader_Reader' which is not found in test class: org.openscience.cdk.io.iterator.IteratingSMILESReaderTest
 io.iterator.IteratingSMILESReader#close has a test method annotation 'testClose' which is not found in test class: org.openscience.cdk.io.iterator.IteratingSMILESReaderTest
 io.MoSSOutputReader#read(IChemObject) does not have a test method
 normalize.Normalizer refers to a non-existing test class: org.openscience.cdk.tools.NormalizerTest
 ------------- ---------------- ---------------
 Testcase: testCoverage(org.openscience.cdk.coverage.SmilesCoverageTest):	FAILED
 The smiles module is not fully tested! Missing number of method tests: 20 in number of classes: 6
 junit.framework.AssertionFailedError: The smiles module is not fully tested! Missing number of method tests: 20 in number of classes: 6
 	at org.openscience.cdk.coverage.CoverageAnnotationTest.runCoverageTest(CoverageAnnotationTest.java:84)
 	at org.openscience.cdk.coverage.SmilesCoverageTest.testCoverage(SmilesCoverageTest.java:43)
 
 
 Testcase: xtestQuinone(org.openscience.cdk.smiles.DeduceBondSystemToolTest):	FAILED
 expected:<SINGLE> but was:<DOUBLE>
 junit.framework.AssertionFailedError: expected:<SINGLE> but was:<DOUBLE>
 	at org.openscience.cdk.smiles.DeduceBondSystemToolTest.xtestQuinone(DeduceBondSystemToolTest.java:238)
 
 
 Testcase: testPyrrole3(org.openscience.cdk.smiles.SmilesParserTest):	FAILED
 The SMILES string 'n1cccc1' is invalid but no exception was thrown.
 junit.framework.AssertionFailedError: The SMILES string 'n1cccc1' is invalid but no exception was thrown.
 	at org.openscience.cdk.smiles.SmilesParserTest.testPyrrole3(SmilesParserTest.java:1527)
 
 
 Testcase: testImidazole3(org.openscience.cdk.smiles.SmilesParserTest):	FAILED
 The SMILES string 'n1cncc1' is invalid but no exception was thrown.
 junit.framework.AssertionFailedError: The SMILES string 'n1cncc1' is invalid but no exception was thrown.
 	at org.openscience.cdk.smiles.SmilesParserTest.testImidazole3(SmilesParserTest.java:1619)
 
 
 Testcase: testAromaticSeParsing(org.openscience.cdk.smiles.SmilesParserTest):	FAILED
 
 junit.framework.AssertionFailedError: 
 	at org.openscience.cdk.smiles.SmilesParserTest.testAromaticSeParsing(SmilesParserTest.java:1861)